{"text_format":"1","workbook":"xlsx","n_sheets":8,"sheets":["ID Map","Status","Assessment","Course Timings","Glossary","Source Map","SME Questions","Raw Data-Course Timing"],"not_rendered":{"charts":0,"images":0,"macros":1,"external_links":0,"defined_names":5,"comments":1,"pivot_tables":0},"unopened":[],"bounds":{"document_bytes":16777216,"sheet_cells":100000,"rows_first":2000,"rows_last":500,"rows_between":2000,"halvings":0,"cell_chars":16384,"cell_head_chars":4096},"cells_cut":0,"cells_raw":0,"read":"whole","date_system":"1900"}

{"sheet":"ID Map","index":0,"n_rows":91,"n_cols":14,"rows_kept":91,"cut":false,"hidden":false,"merged":[[55,2,60,2],[21,2,25,2],[2,1,2,5],[3,1,3,5],[4,1,4,5],[17,1,32,1],[33,1,50,1],[26,2,30,2],[0,0,0,5],[49,3,49,5],[85,3,85,5],[31,3,31,5],[51,1,68,1],[69,1,86,1],[79,2,84,2],[73,2,78,2],[61,2,66,2],[44,2,48,2]]}
["Instructional Design Map:  "]
[]
[null,"Indicates a topic that has no source content available"]
[null,"Indicates a topic that has insufficient source content available"]
[null,"Indicates a question to SME"]
[]
["Course Aim","Course Objectives","Module Objectives","TOPIC","SUBTOPIC","CONTENT","Review Feedback","DURATION","MODULE","TYPE","LEVEL OF DETAIL","SOURCE CONTENT","INSTRUCTIONAL DESIGN APPROACH","NOTES"]
[]
["Course Aim",null,null,"Introduction",null,null,null," "]
[null,null,null,"Introduction",null,"High level overview of the purpose and aim of the course.",null,3,"Introduction","Content","low","NA"," "]
[null,null,null,"Course Introduction/Course Flow",null,"Overview of the structure of the course and content to be covered in the course.",null,3,"Introduction","Content","low","NA"]
[null,null,null,"Course Objectives",null,"Summary of objectives for the course.",null,3,"Introduction","Content","low","NA"]
[null,null,null,"Telsra Our Way Cultural Priorities",null,null,null,1,"Introduction","Content","low","NA"]
[null,null,null,"Tips for getting the most out of this course",null,null,null,3,"Introduction","Content","low","NA"]
[null,null,null,"Activity - Icebreaker  ",null,"Introductory activity to allow participants to introduce themselves to the group."," - D13",10,"Introduction","Activity","low","NA"]
[null,null,null,"Timetable",null,"Breakdown list of modules and times for the course.",null,1,"Introduction","Content","low","NA"]
[null,null,null,"Prerequisites/Post requisites",null,"List of pre and post requisite courses associatee with this course.",null,1,"Introduction","Content","low","NA"]
[null,"Course Objective",null,"Module One - Title",null," "]
[null,null,null,"Module Introduction"]
[null,null,null,"Module Introduction",null,"Overview of content to be covered in this module",null,3,"Module 1","Content","low","NA"]
[null,null,null,"Module One Objectives ",null,"Summary of objectives for this module",null,3,"Module 1","Content","low","NA"]
[null,null,"Module Objective","Section - Header Title"]
[null,null,null," ",null," ",null,null,"Module 1","Content"]
[null,null,null," ",null," ",null,null,"Module 1","Content"]
[null,null,null,"Checkpoint - Title",null,null,null,null,"Module 1","Activity"]
[null,null,null,"Activity - Title",null,null,null,null,"Module 1","Activity"]
[null,null,"Module Objective","Section - Header Title"]
[null,null,null," ",null," ",null,null,"Module 1","Content"]
[null,null,null," ",null," ",null,null,"Module 1","Content"]
[null,null,null,"Checkpoint - Title",null,null,null,null,"Module 1","Activity"]
[null,null,null,"Activity - Title",null,null,null,null,"Module 1","Activity"]
[null,null," ","Module Summary"]
[null,null,null,"Module One Summary",null,"Summary of key points from this module",null,3,"Module 1","Content","low"]
[null,"Course Objective",null,"Module Two - Title",null," "]
[null,null,null,"Module Introduction"]
[null,null,null,"Module Introduction",null,"Overview of content to be covered in this module",null,3,"Module 2","Content","low","NA"]
[null,null,null,"Module Two Objectives",null,"Summary of objectives for this module",null,3,"Module 2","Content","low","NA"]
[null,null,"Module Objective","Section - Header Title"]
[null,null,null,null,null,null,null,null,"Module 2","Content"]
[null,null,null,null,null,null,null,null,"Module 2","Content"]
{"$rows_left_out":52}
{"sheet":"Status","index":1,"n_rows":362,"n_cols":5,"rows_kept":362,"cut":false,"hidden":false,"merged":[]}
[]
[]
[null,{"$f":"'ID Map'!D7","v":"TOPIC"},"Status","Risks","Completion Date"]
[null,{"$f":"'ID Map'!D8","v":0}]
[null,{"$f":"'ID Map'!D9","v":"Introduction"}]
[null,{"$f":"'ID Map'!D10","v":"Introduction"}]
[null,{"$f":"'ID Map'!D11","v":"Course Introduction/Course Flow"}]
[null,{"$f":"'ID Map'!D12","v":"Course Objectives"}]
[null,{"$f":"'ID Map'!D13","v":"Telsra Our Way Cultural Priorities"}]
[null,{"$f":"'ID Map'!D14","v":"Tips for getting the most out of this course"}]
[null,{"$f":"'ID Map'!D15","v":"Activity - Icebreaker  "}]
[null,{"$f":"'ID Map'!D16","v":"Timetable"}]
[null,{"$f":"'ID Map'!D17","v":"Prerequisites/Post requisites"}]
[null,{"$f":"'ID Map'!D18","v":"Module One - Title"}]
[null,{"$f":"'ID Map'!D19","v":"Module Introduction"}]
[null,{"$f":"'ID Map'!D20","v":"Module Introduction"}]
[null,{"$f":"'ID Map'!D21","v":"Module One Objectives "}]
[null,{"$f":"'ID Map'!D22","v":"Section - Header Title"}]
[null,{"$f":"'ID Map'!D23","v":" "}]
[null,{"$f":"'ID Map'!D24","v":" "}]
[null,{"$f":"'ID Map'!D25","v":"Checkpoint - Title"}]
[null,{"$f":"'ID Map'!D26","v":"Activity - Title"}]
[null,{"$f":"'ID Map'!D27","v":"Section - Header Title"}]
[null,{"$f":"'ID Map'!D28","v":" "}]
[null,{"$f":"'ID Map'!D29","v":" "}]
[null,{"$f":"'ID Map'!D30","v":"Checkpoint - Title"}]
[null,{"$f":"'ID Map'!D31","v":"Activity - Title"}]
[null,{"$f":"'ID Map'!D32","v":"Module Summary"}]
[null,{"$f":"'ID Map'!D33","v":"Module One Summary"}]
[null,{"$f":"'ID Map'!D34","v":"Module Two - Title"}]
[null,{"$f":"'ID Map'!D35","v":"Module Introduction"}]
[null,{"$f":"'ID Map'!D36","v":"Module Introduction"}]
[null,{"$f":"'ID Map'!D37","v":"Module Two Objectives"}]
[null,{"$f":"'ID Map'!D38","v":"Section - Header Title"}]
[null,{"$f":"'ID Map'!D39","v":0}]
[null,{"$f":"'ID Map'!D40","v":0}]
[null,{"$f":"'ID Map'!D41","v":0}]
[null,{"$f":"'ID Map'!D42","v":"Checkpoint - Title"}]
[null,{"$f":"'ID Map'!D43","v":"Activity - Title"}]
[null,{"$f":"'ID Map'!D44","v":"Section - Header Title"}]
{"$rows_left_out":323}
{"sheet":"Assessment","index":2,"n_rows":55,"n_cols":11,"rows_kept":55,"cut":false,"hidden":false,"merged":[[22,6,22,11],[53,6,53,7],[53,8,53,9],[53,10,53,11],[54,6,54,7],[54,8,54,9],[54,10,54,11],[51,6,51,7],[51,8,51,9],[51,10,51,11],[52,6,52,7],[52,8,52,9],[52,10,52,11],[49,6,49,7],[49,8,49,9],[49,10,49,11],[50,6,50,7],[50,8,50,9],[50,10,50,11],[47,6,47,7],[47,8,47,9],[47,10,47,11],[48,6,48,7],[48,8,48,9],[48,10,48,11],[45,6,45,7],[45,8,45,9],[45,10,45,11],[46,6,46,7],[46,8,46,9],[46,10,46,11],[43,6,43,7],[43,8,43,9],[43,10,43,11],[44,6,44,7],[44,8,44,9],[44,10,44,11],[41,6,41,7],[41,8,41,9],[41,10,41,11],[42,6,42,7],[42,8,42,9],[42,10,42,11],[39,6,39,7],[39,8,39,9],[39,10,39,11],[40,6,40,7],[40,8,40,9],[40,10,40,11],[37,6,37,7],[37,8,37,9],[37,10,37,11],[38,6,38,7],[38,8,38,9],[38,10,38,11],[35,6,35,7],[35,8,35,9],[35,10,35,11],[36,6,36,7],[36,8,36,9],[36,10,36,11],[33,6,33,7],[33,8,33,9],[33,10,33,11],[34,6,34,7],[34,8,34,9],[34,10,34,11],[30,8,30,9],[30,10,30,11],[31,6,31,7],[31,8,31,9],[31,10,31,11],[32,6,32,7],[32,8,32,9],[32,10,32,11],[24,10,24,11],[25,10,25,11],[26,10,26,11],[27,10,27,11],[28,10,28,11],[29,6,29,7],[29,8,29,9],[29,10,29,11],[53,3,53,5],[54,3,54,5],[24,8,24,9],[25,8,25,9],[26,8,26,9],[27,8,27,9],[28,8,28,9],[30,6,30,7],[47,3,47,5],[48,3,48,5],[49,3,49,5],[50,3,50,5],[51,3,51,5],[52,3,52,5],[41,3,41,5],[42,3,42,5],[43,3,43,5],[44,3,44,5],[45,3,45,5],[46,3,46,5],[35,3,35,5],[36,3,36,5],[37,3,37,5],[38,3,38,5],[39,3,39,5],[40,3,40,5],[29,3,29,5],[30,3,30,5],[31,3,31,5],[32,3,32,5],[33,3,33,5],[34,3,34,5],[25,3,25,5],[26,3,26,5],[27,3,27,5],[28,3,28,5],[28,6,28,7],[25,6,25,7],[26,6,26,7],[27,6,27,7],[0,0,0,6],[1,0,1,6],[3,0,3,9],[23,1,23,5],[23,6,23,7],[23,8,23,11],[5,1,5,8],[7,1,7,6],[8,1,8,6],[9,1,9,6],[10,1,10,6],[11,1,11,6],[12,1,12,6],[24,6,24,7],[13,1,13,6],[14,1,14,6],[15,1,15,6],[16,1,16,6],[17,1,17,6],[24,3,24,5]]}
[{"$f":"'ID Map'!A1:N1","v":"Instructional Design Map:  "},null,null,null,null,null,null,null,null,"Count",{"$f":"COUNTIF(G26:H55,\"Multiple Choice (one response)\")","v":0}]
["Assessment",null,null,null,null,null,null,null,null," "," "]
[]
["Part A: Determine the number of questions required to align with each course objective, Complete Course Objectives Summary, Module name and Percentage Value columns."]
[]
[null,"Expected number of questions required for the assessment",null,null,null,null,null,null,null,0]
[null," "]
["Objective #","Course Objectives Summary",null,null,null,null,null,"Module","Percentage Value","Questions"]
[1,null,null,null,null,null,null,null,null,{"$f":"I9*$J$6","v":0}]
[2,null,null,null,null,null,null,null,null,0]
[3,null,null,null,null,null,null,null,null,0]
[4,null,null,null,null,null,null,null,null,0]
[5,null,null,null,null,null,null,null,null,0]
[6,null,null,null,null,null,null,null,null,0]
[7,null,null,null,null,null,null,null,null,0]
[8,null,null,null,null,null,null,null,null,0]
[9,null,null,null,null,null,null,null,null,0]
[10,null,null,null,null,null,null,null,null,0]
[]
["Part B: Determine the question topic (ID map Topic) that maps to the course objective"]
["Part C: Enter the Question type from the pull down list. The assessment must include a minimum of 50% \"Multiple Choice (one response)' answers"]
["Part D: Enter the page reference and answer reference from your completed guide (optional)"]
[null,null,null,null,null,null,{"$f":"'Raw Data-Course Timing'!K8","v":""}]
[null,"Part B",null,null,null,null,"Part C",null,"Part D"]
["Question","Objective #","Module","Question Topic",null,null,"Question Type",null,"Question Reference",null,"Answer Reference"]
[1]
[2," "]
[3," "]
[4," "]
[5," "]
[6]
[7]
[8]
[9]
[10]
[11]
[12]
[13]
[14]
[15]
{"$rows_left_out":16}
{"sheet":"Course Timings","index":3,"n_rows":29,"n_cols":9,"rows_kept":29,"cut":false,"hidden":false,"merged":[[0,0,0,9],[1,0,1,4]]}
[{"$f":"'ID Map'!A1:N1","v":"Instructional Design Map:  "}]
["Course Timings"]
["Enter your course information to the Course Type and Course Time fields only"]
[null,null,null,null,null,null,"Hours","Minutes"]
["Course Type","ILT2.5",null,null,"Course Time",null,0,0]
[]
[]
["Course Split","Activity","Content",null,"Course Timing",null,"Activity","Content","Totals"]
["Expected Split",{"$f":"VLOOKUP($B$5,'Raw Data-Course Timing'!$F$6:$H$10,2)","v":0.5},{"$f":"VLOOKUP($B$5,'Raw Data-Course Timing'!$F$6:$H$10,3)","v":0.5},null,"Time Available",null,{"$f":"B9*I9","v":0},{"$f":"C9*I9","v":0},{"$f":"(G5*60)+H5","v":0}]
["Current Split",{"$f":"B29/$D$29","v":0.13157894736842105},{"$f":"C29/$D$29","v":0.86842105263157898},null,"Current Time",null,{"$f":"B29","v":10},{"$f":"C29","v":66},{"$f":"SUM(G10:H10)","v":76}]
[]
["Difference",{"$f":"B9-B10","v":0.36842105263157898},{"$f":"C9-C10","v":-0.36842105263157898},null,"Difference",null,{"$f":"G9-G10","v":-10},{"$f":"H9-H10","v":-66},{"$f":"I9-I10","v":-76}]
[]
[]
["Sum of Duration"]
["Module","Activity","Content","Total","Hours","Minutes"]
["Introduction",{"$f":"SUM(IF(ISNA('ID Map'!$I$9:$I$207)=FALSE,IF('ID Map'!$I$9:$I$207=$A17,IF(ISNA('ID Map'!$J$9:$J$207)=FALSE,IF('ID Map'!$J$9:$J$207=B$16,IF(ISNA('ID Map'!$H$9:$H$207)=FALSE,'ID Map'!$H$9:$H$207))))))","v":10},{"$f":"SUM(IF(ISNA('ID Map'!$I$9:$I$207)=FALSE,IF('ID Map'!$I$9:$I$207=$A17,IF(ISNA('ID Map'!$J$9:$J$207)=FALSE,IF('ID Map'!$J$9:$J$207=C$16,IF(ISNA('ID Map'!$H$9:$H$207)=FALSE,'ID Map'!$H$9:$H$207))))))","v":15},{"$f":"SUM(B17:C17)","v":25}]
["Module 1",{"$f":"SUM(IF(ISNA('ID Map'!$I$9:$I$207)=FALSE,IF('ID Map'!$I$9:$I$207=$A18,IF(ISNA('ID Map'!$J$9:$J$207)=FALSE,IF('ID Map'!$J$9:$J$207=B$16,IF(ISNA('ID Map'!$H$9:$H$207)=FALSE,'ID Map'!$H$9:$H$207))))))","v":0},{"$f":"SUM(IF(ISNA('ID Map'!$I$9:$I$207)=FALSE,IF('ID Map'!$I$9:$I$207=$A18,IF(ISNA('ID Map'!$J$9:$J$207)=FALSE,IF('ID Map'!$J$9:$J$207=C$16,IF(ISNA('ID Map'!$H$9:$H$207)=FALSE,'ID Map'!$H$9:$H$207))))))","v":9},{"$f":"SUM(B18:C18)","v":9}," "]
["Module 2",{"$f":"SUM(IF(ISNA('ID Map'!$I$9:$I$207)=FALSE,IF('ID Map'!$I$9:$I$207=$A19,IF(ISNA('ID Map'!$J$9:$J$207)=FALSE,IF('ID Map'!$J$9:$J$207=B$16,IF(ISNA('ID Map'!$H$9:$H$207)=FALSE,'ID Map'!$H$9:$H$207))))))","v":0},{"$f":"SUM(IF(ISNA('ID Map'!$I$9:$I$207)=FALSE,IF('ID Map'!$I$9:$I$207=$A19,IF(ISNA('ID Map'!$J$9:$J$207)=FALSE,IF('ID Map'!$J$9:$J$207=C$16,IF(ISNA('ID Map'!$H$9:$H$207)=FALSE,'ID Map'!$H$9:$H$207))))))","v":9},{"$f":"SUM(B19:C19)","v":9}]
["Module 3",{"$f":"SUM(IF(ISNA('ID Map'!$I$9:$I$207)=FALSE,IF('ID Map'!$I$9:$I$207=$A20,IF(ISNA('ID Map'!$J$9:$J$207)=FALSE,IF('ID Map'!$J$9:$J$207=B$16,IF(ISNA('ID Map'!$H$9:$H$207)=FALSE,'ID Map'!$H$9:$H$207))))))","v":0},{"$f":"SUM(IF(ISNA('ID Map'!$I$9:$I$207)=FALSE,IF('ID Map'!$I$9:$I$207=$A20,IF(ISNA('ID Map'!$J$9:$J$207)=FALSE,IF('ID Map'!$J$9:$J$207=C$16,IF(ISNA('ID Map'!$H$9:$H$207)=FALSE,'ID Map'!$H$9:$H$207))))))","v":9},{"$f":"SUM(B20:C20)","v":9}]
["Module 4",{"$f":"SUM(IF(ISNA('ID Map'!$I$9:$I$207)=FALSE,IF('ID Map'!$I$9:$I$207=$A21,IF(ISNA('ID Map'!$J$9:$J$207)=FALSE,IF('ID Map'!$J$9:$J$207=B$16,IF(ISNA('ID Map'!$H$9:$H$207)=FALSE,'ID Map'!$H$9:$H$207))))))","v":0},{"$f":"SUM(IF(ISNA('ID Map'!$I$9:$I$207)=FALSE,IF('ID Map'!$I$9:$I$207=$A21,IF(ISNA('ID Map'!$J$9:$J$207)=FALSE,IF('ID Map'!$J$9:$J$207=C$16,IF(ISNA('ID Map'!$H$9:$H$207)=FALSE,'ID Map'!$H$9:$H$207))))))","v":9},{"$f":"SUM(B21:C21)","v":9}]
["Module 5",{"$f":"SUM(IF(ISNA('ID Map'!$I$9:$I$207)=FALSE,IF('ID Map'!$I$9:$I$207=$A22,IF(ISNA('ID Map'!$J$9:$J$207)=FALSE,IF('ID Map'!$J$9:$J$207=B$16,IF(ISNA('ID Map'!$H$9:$H$207)=FALSE,'ID Map'!$H$9:$H$207))))))","v":0},{"$f":"SUM(IF(ISNA('ID Map'!$I$9:$I$207)=FALSE,IF('ID Map'!$I$9:$I$207=$A22,IF(ISNA('ID Map'!$J$9:$J$207)=FALSE,IF('ID Map'!$J$9:$J$207=C$16,IF(ISNA('ID Map'!$H$9:$H$207)=FALSE,'ID Map'!$H$9:$H$207))))))","v":0},{"$f":"SUM(B22:C22)","v":0}]
["Module 6",{"$f":"SUM(IF(ISNA('ID Map'!$I$9:$I$207)=FALSE,IF('ID Map'!$I$9:$I$207=$A23,IF(ISNA('ID Map'!$J$9:$J$207)=FALSE,IF('ID Map'!$J$9:$J$207=B$16,IF(ISNA('ID Map'!$H$9:$H$207)=FALSE,'ID Map'!$H$9:$H$207))))))","v":0},{"$f":"SUM(IF(ISNA('ID Map'!$I$9:$I$207)=FALSE,IF('ID Map'!$I$9:$I$207=$A23,IF(ISNA('ID Map'!$J$9:$J$207)=FALSE,IF('ID Map'!$J$9:$J$207=C$16,IF(ISNA('ID Map'!$H$9:$H$207)=FALSE,'ID Map'!$H$9:$H$207))))))","v":0},0]
["Module 7",{"$f":"SUM(IF(ISNA('ID Map'!$I$9:$I$207)=FALSE,IF('ID Map'!$I$9:$I$207=$A24,IF(ISNA('ID Map'!$J$9:$J$207)=FALSE,IF('ID Map'!$J$9:$J$207=B$16,IF(ISNA('ID Map'!$H$9:$H$207)=FALSE,'ID Map'!$H$9:$H$207))))))","v":0},{"$f":"SUM(IF(ISNA('ID Map'!$I$9:$I$207)=FALSE,IF('ID Map'!$I$9:$I$207=$A24,IF(ISNA('ID Map'!$J$9:$J$207)=FALSE,IF('ID Map'!$J$9:$J$207=C$16,IF(ISNA('ID Map'!$H$9:$H$207)=FALSE,'ID Map'!$H$9:$H$207))))))","v":0},0]
["Module 8",{"$f":"SUM(IF(ISNA('ID Map'!$I$9:$I$207)=FALSE,IF('ID Map'!$I$9:$I$207=$A25,IF(ISNA('ID Map'!$J$9:$J$207)=FALSE,IF('ID Map'!$J$9:$J$207=B$16,IF(ISNA('ID Map'!$H$9:$H$207)=FALSE,'ID Map'!$H$9:$H$207))))))","v":0},{"$f":"SUM(IF(ISNA('ID Map'!$I$9:$I$207)=FALSE,IF('ID Map'!$I$9:$I$207=$A25,IF(ISNA('ID Map'!$J$9:$J$207)=FALSE,IF('ID Map'!$J$9:$J$207=C$16,IF(ISNA('ID Map'!$H$9:$H$207)=FALSE,'ID Map'!$H$9:$H$207))))))","v":0},0]
["Module 9",{"$f":"SUM(IF(ISNA('ID Map'!$I$9:$I$207)=FALSE,IF('ID Map'!$I$9:$I$207=$A26,IF(ISNA('ID Map'!$J$9:$J$207)=FALSE,IF('ID Map'!$J$9:$J$207=B$16,IF(ISNA('ID Map'!$H$9:$H$207)=FALSE,'ID Map'!$H$9:$H$207))))))","v":0},{"$f":"SUM(IF(ISNA('ID Map'!$I$9:$I$207)=FALSE,IF('ID Map'!$I$9:$I$207=$A26,IF(ISNA('ID Map'!$J$9:$J$207)=FALSE,IF('ID Map'!$J$9:$J$207=C$16,IF(ISNA('ID Map'!$H$9:$H$207)=FALSE,'ID Map'!$H$9:$H$207))))))","v":0},0]
["Module 10",{"$f":"SUM(IF(ISNA('ID Map'!$I$9:$I$207)=FALSE,IF('ID Map'!$I$9:$I$207=$A27,IF(ISNA('ID Map'!$J$9:$J$207)=FALSE,IF('ID Map'!$J$9:$J$207=B$16,IF(ISNA('ID Map'!$H$9:$H$207)=FALSE,'ID Map'!$H$9:$H$207))))))","v":0},{"$f":"SUM(IF(ISNA('ID Map'!$I$9:$I$207)=FALSE,IF('ID Map'!$I$9:$I$207=$A27,IF(ISNA('ID Map'!$J$9:$J$207)=FALSE,IF('ID Map'!$J$9:$J$207=C$16,IF(ISNA('ID Map'!$H$9:$H$207)=FALSE,'ID Map'!$H$9:$H$207))))))","v":0},0]
["Conclusion",{"$f":"SUM(IF(ISNA('ID Map'!$I$9:$I$207)=FALSE,IF('ID Map'!$I$9:$I$207=$A28,IF(ISNA('ID Map'!$J$9:$J$207)=FALSE,IF('ID Map'!$J$9:$J$207=B$16,IF(ISNA('ID Map'!$H$9:$H$207)=FALSE,'ID Map'!$H$9:$H$207))))))","v":0},{"$f":"SUM(IF(ISNA('ID Map'!$I$9:$I$207)=FALSE,IF('ID Map'!$I$9:$I$207=$A28,IF(ISNA('ID Map'!$J$9:$J$207)=FALSE,IF('ID Map'!$J$9:$J$207=C$16,IF(ISNA('ID Map'!$H$9:$H$207)=FALSE,'ID Map'!$H$9:$H$207))))))","v":15},{"$f":"SUM(B28:C28)","v":15}]
["Grand Total",{"$f":"SUM(B17:B28)","v":10},{"$f":"SUM(C17:C28)","v":66},{"$f":"SUM(D17:D28)","v":76}]

{"sheet":"Glossary","index":4,"n_rows":10,"n_cols":3,"rows_kept":10,"cut":false,"hidden":false,"merged":[[0,0,0,11],[2,0,2,2]]}
[{"$f":"'ID Map'!A1:F1","v":"Instructional Design Map:  "}]
["Glossary"]
["This sheet may be used to collate information regarding common terms or the formatting for words or acronyms used in the course."]
["Eg1 :MDU","Multi Dwelling Unit","Description of appartment blocks or residence where multiple taps may be located such as retirement villages"]
["Eg 2: Lead-in",null,"to be written as capital L and hyphen"]
[]
["Acronym or Correct formatting","Term","Meaning or Description"]
[]
[]
[null,null," "]

{"sheet":"Source Map","index":5,"n_rows":5,"n_cols":9,"rows_kept":5,"cut":false,"hidden":false,"merged":[[0,0,0,7],[3,3,3,8],[3,0,4,0],[3,1,4,1],[3,2,4,2]]}
[{"$f":"'ID Map'!A1:N1","v":"Instructional Design Map:  "}]
["Source Map"]
[null,null,null,"Indicate if a page reference has been mapped to the ID map by changing the background to green"]
["Document Title","Document Location","Provided by","Page References and Topic Titles"]
[null,null,null,"Topic Title","Page #","Topic Title","Page #","Topic Title","Page #"]

{"sheet":"SME Questions","index":6,"n_rows":4,"n_cols":3,"rows_kept":4,"cut":false,"hidden":true,"merged":[[0,0,0,10]]}
[{"$f":"'ID Map'!A1:F1","v":"Instructional Design Map:  "}]
["Questions"]
[]
["SME Question","Topic/Module","Action/Outcome"]

{"sheet":"Raw Data-Course Timing","index":7,"n_rows":251,"n_cols":12,"rows_kept":251,"cut":false,"hidden":true,"merged":[[4,5,4,7],[4,1,4,3]]}
[null,"Remove or Hide this sheet before presenting to client."]
[null,"Do not alter/amend these formulas"]
[null,"All fields must have an entry for the table to calculate correctly, alterations are to be made only to the ID map)"]
[]
[null,"ID MAP Page",null,null,null,"Couse Timings Page",null,null,null,"Assessment"]
[null,{"$f":"'ID Map'!H7","v":"DURATION"},{"$f":"'ID Map'!I7","v":"MODULE"},{"$f":"'ID Map'!J7","v":"TYPE"},null,"Course Type","Activity%","Content%",null,"Total Qs",0.5,"Count "]
[null,{"$f":"'ID Map'!H10","v":3},{"$f":"'ID Map'!I10","v":"Introduction"},{"$f":"'ID Map'!J10","v":"Content"},null,"ILT2",0.3,0.7,null,{"$f":"Assessment!J6","v":0},{"$f":"J7*K6","v":0},{"$f":"COUNTIF(Assessment!G26:H55,\"Multiple Choice (one response)\")","v":0}]
[null,{"$f":"'ID Map'!H11","v":3},{"$f":"'ID Map'!I11","v":"Introduction"},{"$f":"'ID Map'!J11","v":"Content"},null,"ILT2.5",0.5,0.5,null,"Result",{"$f":"IF(L7<K7,\"More Multiple Choice (one response) questions are required to achieve the 50% ratio per Part C\",\"\")","v":""}]
[null,{"$f":"'ID Map'!H12","v":3},{"$f":"'ID Map'!I12","v":"Introduction"},{"$f":"'ID Map'!J12","v":"Content"},null,"ILT3",0.8,0.2,null," "," "]
[null,{"$f":"'ID Map'!H15","v":10},{"$f":"'ID Map'!I15","v":"Introduction"},{"$f":"'ID Map'!J15","v":"Activity"},null,"WBT","NA","NA",null," "]
[null,{"$f":"'ID Map'!H16","v":1},{"$f":"'ID Map'!I16","v":"Introduction"},{"$f":"'ID Map'!J16","v":"Content"},null,null," "]
[null,{"$f":"'ID Map'!H17","v":1},{"$f":"'ID Map'!I17","v":"Introduction"},{"$f":"'ID Map'!J17","v":"Content"}]
[null,{"$f":"'ID Map'!H18","v":0},{"$f":"'ID Map'!I18","v":0},{"$f":"'ID Map'!J18","v":0}]
[null,{"$f":"'ID Map'!H19","v":0},{"$f":"'ID Map'!I19","v":0},{"$f":"'ID Map'!J19","v":0}]
[null,{"$f":"'ID Map'!H20","v":3},{"$f":"'ID Map'!I20","v":"Module 1"},{"$f":"'ID Map'!J20","v":"Content"}]
[null,{"$f":"'ID Map'!H21","v":3},{"$f":"'ID Map'!I21","v":"Module 1"},{"$f":"'ID Map'!J21","v":"Content"}]
[null,{"$f":"'ID Map'!H22","v":0},{"$f":"'ID Map'!I22","v":0},{"$f":"'ID Map'!J22","v":0}]
[null,{"$f":"'ID Map'!H23","v":0},{"$f":"'ID Map'!I23","v":"Module 1"},{"$f":"'ID Map'!J23","v":"Content"}]
[null,{"$f":"'ID Map'!H24","v":0},{"$f":"'ID Map'!I24","v":"Module 1"},{"$f":"'ID Map'!J24","v":"Content"}]
[null,{"$f":"'ID Map'!H25","v":0},{"$f":"'ID Map'!I25","v":"Module 1"},{"$f":"'ID Map'!J25","v":"Activity"}]
[null,{"$f":"'ID Map'!H26","v":0},{"$f":"'ID Map'!I26","v":"Module 1"},{"$f":"'ID Map'!J26","v":"Activity"}]
[null,{"$f":"'ID Map'!H27","v":0},{"$f":"'ID Map'!I27","v":0},{"$f":"'ID Map'!J27","v":0}]
[null,{"$f":"'ID Map'!H28","v":0},{"$f":"'ID Map'!I28","v":"Module 1"},{"$f":"'ID Map'!J28","v":"Content"}]
[null,{"$f":"'ID Map'!H29","v":0},{"$f":"'ID Map'!I29","v":"Module 1"},{"$f":"'ID Map'!J29","v":"Content"}]
[null,{"$f":"'ID Map'!H30","v":0},{"$f":"'ID Map'!I30","v":"Module 1"},{"$f":"'ID Map'!J30","v":"Activity"}]
[null,{"$f":"'ID Map'!H31","v":0},{"$f":"'ID Map'!I31","v":"Module 1"},{"$f":"'ID Map'!J31","v":"Activity"}]
[null,{"$f":"'ID Map'!H32","v":0},{"$f":"'ID Map'!I32","v":0},{"$f":"'ID Map'!J32","v":0}]
[null,{"$f":"'ID Map'!H33","v":3},{"$f":"'ID Map'!I33","v":"Module 1"},{"$f":"'ID Map'!J33","v":"Content"}]
[null,{"$f":"'ID Map'!H34","v":0},{"$f":"'ID Map'!I34","v":0},{"$f":"'ID Map'!J34","v":0}]
[null,{"$f":"'ID Map'!H35","v":0},{"$f":"'ID Map'!I35","v":0},{"$f":"'ID Map'!J35","v":0}]
[null,{"$f":"'ID Map'!H36","v":3},{"$f":"'ID Map'!I36","v":"Module 2"},{"$f":"'ID Map'!J36","v":"Content"}]
[null,{"$f":"'ID Map'!H37","v":3},{"$f":"'ID Map'!I37","v":"Module 2"},{"$f":"'ID Map'!J37","v":"Content"}]
[null,{"$f":"'ID Map'!H38","v":0},{"$f":"'ID Map'!I38","v":0},{"$f":"'ID Map'!J38","v":0}]
[null,{"$f":"'ID Map'!H39","v":0},{"$f":"'ID Map'!I39","v":"Module 2"},{"$f":"'ID Map'!J39","v":"Content"}]
[null,{"$f":"'ID Map'!H40","v":0},{"$f":"'ID Map'!I40","v":"Module 2"},{"$f":"'ID Map'!J40","v":"Content"}]
[null,{"$f":"'ID Map'!H41","v":0},{"$f":"'ID Map'!I41","v":"Module 2"},{"$f":"'ID Map'!J41","v":"Content"}]
[null,{"$f":"'ID Map'!H42","v":0},{"$f":"'ID Map'!I42","v":"Module 2"},{"$f":"'ID Map'!J42","v":"Activity"}]
[null,{"$f":"'ID Map'!H43","v":0},{"$f":"'ID Map'!I43","v":"Module 2"},{"$f":"'ID Map'!J43","v":"Activity"}]
[null,{"$f":"'ID Map'!H44","v":0},{"$f":"'ID Map'!I44","v":0},{"$f":"'ID Map'!J44","v":0}]
[null,{"$f":"'ID Map'!H45","v":0},{"$f":"'ID Map'!I45","v":"Module 2"},{"$f":"'ID Map'!J45","v":"Content"}]
{"$rows_left_out":211}